Target
Tyrosine-protein phosphatase non-receptor type 2
Ligand
BDBM13815
Substrate
BDBM13594
Meas. Tech.
PTP1B and TCPTP Inhibition Assay
pH
6.3±n/a
Temperature
295.15±n/a K
IC50
95±7 nM
Citation
 Asante-Appiah, EPatel, SDesponts, CTaylor, JMLau, CDufresne, CTherien, MFriesen, RBecker, JWLeblanc, YKennedy, BPScapin, G Conformation-assisted inhibition of protein-tyrosine phosphatase-1B elicits inhibitor selectivity over T-cell protein-tyrosine phosphatase. J Biol Chem 281:8010-5 (2006)  
Target
Name:
Tyrosine-protein phosphatase non-receptor type 2
Synonyms:
PTN2_HUMAN PTPT T-cell protein-tyrosine phosphatase TCPTP Tyrosine-protein phosphatase non-receptor type 2 (TC-PTP)
Type:
Protein
Mol. Mass.:
48481.80
Organism:
Homo sapiens (Human)
Description:
P17706
Residue:
415
  
Inhibitor
Name:
BDBM13815
Synonyms:
({4-[(4E)-2-(1H-1,2,3-benzotriazol-1-yl)-2,5-diphenylpent-4-en-1-yl]phenyl}difluoromethyl)phosphonic acid benzotriazole phenyldifluoromethylphosphonic acid compound 2
Type:
Small organic molecule
Emp. Form.:
C30H26F2N3O3P
Mol. Mass.:
545.5163
SMILES:
OP(O)(=O)C(F)(F)c1ccc(CC(C\C=C\c2ccccc2)(c2ccccc2)n2nnc3ccccc23)cc1
:
Substrate
Name:
BDBM13594
Synonyms:
Fluorescein diphosphate (FDP) fluorescein diphosphate, tetraammonium salt
Type:
Small organic molecule
Emp. Form.:
C20H10O11P2
Mol. Mass.:
488.2365
SMILES:
[O-]P([O-])(=O)Oc1ccc2c(Oc3cc(OP([O-])([O-])=O)ccc3C22OC(=O)c3ccccc23)c1
: