Target
Isoform 1 of Metabotropic glutamate receptor 5 (5a)
Ligand
BDBM143698
Substrate
Meas. Tech.
Pharmacological Assay
Ki
281±n/a nM
Citation
 Jaeschke, GLindemann, LMartin, RERicci, ARueher, DStadler, HVieira, E Ethynyl derivatives US Patent  US9751856 Publication Date 9/5/2017 
Target
Name:
Isoform 1 of Metabotropic glutamate receptor 5 (5a)
Synonyms:
GRM5_RAT Grm5 Metabotropic glutamate receptor 5 (5a) | Mglur5
Type:
Protein
Mol. Mass.:
128300.55
Organism:
Rattus norvegicus (Rat)
Description:
P31424-2 Isoform 1
Residue:
1171
  
Inhibitor
Name:
BDBM143698
Synonyms:
US9682959, 5 | US9751856, 5
Type:
Small organic molecule
Emp. Form.:
C18H16N4O
Mol. Mass.:
304.3458
SMILES:
CN1C(=O)C(C)(C)N=C1c1ncc(cn1)C#Cc1ccccc1
: