Target
Isoform 1 of Metabotropic glutamate receptor 5 (5a)
Ligand
BDBM143699
Substrate
Meas. Tech.
Pharmacological Assay
Ki
280±n/a nM
Citation
 Jaeschke, GLindemann, LMartin, RERicci, ARueher, DStadler, HVieira, E Ethynyl derivatives US Patent  US9751856 Publication Date 9/5/2017 
Target
Name:
Isoform 1 of Metabotropic glutamate receptor 5 (5a)
Synonyms:
GRM5_RAT Grm5 Metabotropic glutamate receptor 5 (5a) | Mglur5
Type:
Protein
Mol. Mass.:
128300.55
Organism:
Rattus norvegicus (Rat)
Description:
P31424-2 Isoform 1
Residue:
1171
  
Inhibitor
Name:
BDBM143699
Synonyms:
US9682959, 6 | US9751856, 6
Type:
Small organic molecule
Emp. Form.:
C18H15FN4O
Mol. Mass.:
322.3363
SMILES:
CN1C(=O)C(C)(C)N=C1c1ncc(cn1)C#Cc1cccc(F)c1
: