Target
Sodium channel protein type 9 subunit alpha
Ligand
BDBM196451
Substrate
Meas. Tech.
Electrophysiology Assay
Ki
290±n/a nM
Citation
 Kyle, DJNi, CTafesse, LYao, J Aryl substituted indoles and the use thereof US Patent  US10202344 Publication Date 2/12/2019 
Target
Name:
Sodium channel protein type 9 subunit alpha
Synonyms:
NENA Peripheral sodium channel 1 SCN9A_HUMAN Voltage-gated sodium channel subunit Nav1.7 hNE-Na
Type:
Protein
Mol. Mass.:
226375.97
Organism:
Homo sapiens (Human)
Description:
Q15858
Residue:
1988
  
Inhibitor
Name:
BDBM196451
Synonyms:
US10202344, Compound 44 | US9212139, 44
Type:
Small organic molecule
Emp. Form.:
C25H20F3N3O2
Mol. Mass.:
451.4404
SMILES:
N[C@@H](CO)Cc1cn(-c2ccc(Oc3ccc(c(c3)C#N)C(F)(F)F)cc2)c2ccccc12
: