Target
Rho-associated protein kinase 1
Ligand
BDBM14029
Substrate
ROCK I Peptide Substrate
Meas. Tech.
Kinase Activity Assay
pH
7.6±n/a
Temperature
303.15±n/a K
Ki
150±n/a nM
Citation
 Jacobs, MHayakawa, KSwenson, LBellon, SFleming, MTaslimi, PDoran, J The structure of dimeric ROCK I reveals the mechanism for ligand selectivity. J Biol Chem 281:260-8 (2006)  
Target
Name:
Rho-associated protein kinase 1
Synonyms:
ROCK-I ROCK1_HUMAN Rho-associated protein kinase Rho-associated, coiled-coil-containing protein kinase 1 Rho-kinase (ROCK I) p160 ROCK-1 | p160ROCK
Type:
Serine/threonine-protein kinase
Mol. Mass.:
158156.77
Organism:
Homo sapiens (Human)
Description:
Q13464
Residue:
1354
  
Inhibitor
Name:
BDBM14029
Synonyms:
(R)-TRANS-4-(1-AMINOETHYL)-N-(4-PYRIDYL) CYCLOHEXANECARBOXAMIDE US10183931, Y-27632 | Y-27632
Type:
Small organic molecule
Emp. Form.:
C14H21N3O
Mol. Mass.:
247.336
SMILES:
[H][C@@]1(CC[C@@]([H])(CC1)C(=O)Nc1ccncc1)[C@@H](C)N
:
Substrate
Name:
ROCK I Peptide Substrate
Synonyms:
Type:
Peptide
Mol. Mass.:
1105.34
Organism:
Description:
Residue:
9
KKRNRTLSV