Target
Prothrombin
Ligand
BDBM14145
Substrate
BDBM12679
Meas. Tech.
Enzyme Assay and Determination of the Inhibition Constants
Ki
30000±n/a nM
Citation
 Katz, BASprengeler, PALuong, CVerner, EElrod, KKirtley, MJanc, JSpencer, JRBreitenbucher, JGHui, HMcGee, DAllen, DMartelli, AMackman, RL Engineering inhibitors highly selective for the S1 sites of Ser190 trypsin-like serine protease drug targets. Chem Biol 8:1107-21 (2001)  
Target
Name:
Prothrombin
Synonyms:
Activation peptide fragment 1 Coagulation factor II Prothrombin precursor Thrombin heavy chain | Thrombin light chain
Type:
Protein
Mol. Mass.:
70029.57
Organism:
Homo sapiens (Human)
Description:
P00734
Residue:
622
  
Inhibitor
Name:
BDBM14145
Synonyms:
2-{5-[amino(iminiumyl)methyl]-1H-1,3-benzodiazol-2-yl}-6-(2-methylpropoxy)benzen-1-olate CA-08
Type:
Small organic molecule
Emp. Form.:
C18H20N4O2
Mol. Mass.:
324.377
SMILES:
CC(C)COc1cccc(-c2nc3ccc(cc3[nH]2)C(N)=[NH2+])c1[O-]
:
Substrate
Name:
BDBM12679
Synonyms:
BDBM13790 Chromogenic Substrate
Type:
Small organic molecule
Emp. Form.:
C26H34N6O7S
Mol. Mass.:
574.649
SMILES:
Cc1ccc(cc1)S(=O)(=O)NCC(=O)N1CCCC1C(=O)NC(CCCCN)C(=O)Nc1ccc(cc1)[N+]([O-])=O
: