Target
Coagulation factor X
Ligand
BDBM14144
Substrate
BDBM12989
Meas. Tech.
Enzyme Assay and Determination of the Inhibition Constants
Ki
1400±n/a nM
Citation
 Katz, BASprengeler, PALuong, CVerner, EElrod, KKirtley, MJanc, JSpencer, JRBreitenbucher, JGHui, HMcGee, DAllen, DMartelli, AMackman, RL Engineering inhibitors highly selective for the S1 sites of Ser190 trypsin-like serine protease drug targets. Chem Biol 8:1107-21 (2001)  
Target
Name:
Coagulation factor X
Synonyms:
Activated coagulation factor X (FXa) Coagulation factor X precursor F10 Factor X heavy chain Factor Xa Stuart-Prower factor
Type:
Enzyme
Mol. Mass.:
54726.60
Organism:
Homo sapiens (Human)
Description:
Residue:
488
  
Inhibitor
Name:
BDBM14144
Synonyms:
2-{5-[amino(iminiumyl)methyl]-1H-1,3-benzodiazol-2-yl}-6-(cyclopentyloxy)benzen-1-olate CA-06
Type:
Small organic molecule
Emp. Form.:
C19H20N4O2
Mol. Mass.:
336.3877
SMILES:
NC(=[NH2+])c1ccc2nc([nH]c2c1)-c1cccc(OC2CCCC2)c1[O-]
:
Substrate
Name:
BDBM12989
Synonyms:
CH3OCO-D-CHA-Gly-Arg-pNA.AcOH acetic acid; methyl N-[(1R)-1-[({[(1S)-4-carbamimidamido-1-[(4-nitrophenyl)carbamoyl]butyl]carbamoyl}methyl)carbamoyl]-2-cyclohexylethyl]carbamate
Type:
Small organic molecule
Emp. Form.:
C25H38N8O7
Mol. Mass.:
562.6186
SMILES:
COC(=O)N[C@H](CC1CCCCC1)C(=O)NCC(=O)N[C@@H](CCC[NH+]=C(N)[NH-])C(=O)Nc1ccc(cc1)[N+]([O-])=O
: