Target
Calcium-dependent protein kinase 1
Ligand
BDBM50389696
Substrate
Meas. Tech.
Biological Assay
IC50
2.10±n/a nM
Citation
 Van Voorhis, WCHol, WGLarson, ETMaly, DJMerritt, EOjo, KK Compositions and methods for treating toxoplasmosis, cryptosporidiosis, and other apicomplexan protozoan related diseases US Patent  US9765037 Publication Date 9/19/2017 
Target
Name:
Calcium-dependent protein kinase 1
Synonyms:
Calcium-dependent protein kinase 1 (CDPK1)
Type:
Protein
Mol. Mass.:
76617.33
Organism:
Cryptosporidium parvum
Description:
Q6S4W0
Residue:
677
  
Inhibitor
Name:
BDBM50389696
Synonyms:
CHEMBL2070063 US11247972, Compound 34 | US9765037, Compound 34
Type:
Small organic molecule
Emp. Form.:
C28H28N6O
Mol. Mass.:
464.5615
SMILES:
Nc1ncnc2n(CC3CCNCC3)nc(-c3ccc4cc(OCc5ccccc5)ccc4c3)c12
: