Target
cAMP-specific 3',5'-cyclic phosphodiesterase 4D
Ligand
BDBM14370
Substrate
BDBM10851
Meas. Tech.
PDE Activity Assay
Ki
4.8±n/a nM
Citation
 Whitehead, JWLee, GPGharagozloo, PHofer, PGehrig, AWintergerst, PSmyth, DMcCoull, WHachicha, MPatel, AKyle, DJ 8-Substituted analogues of 3-(3-cyclopentyloxy-4-methoxy-benzyl)-8-isopropyladenine: highly potent and selective PDE4 inhibitors. J Med Chem 48:1237-43 (2005)  
Target
Name:
cAMP-specific 3',5'-cyclic phosphodiesterase 4D
Synonyms:
3',5'-cyclic phosphodiesterase PDE43 PDE4D_HUMAN | Phosphodiesterase 4D
Type:
Protein
Mol. Mass.:
91092.69
Organism:
Homo sapiens (Human)
Description:
Q08499
Residue:
809
  
Inhibitor
Name:
BDBM14370
Synonyms:
8-{1-[(4-Chlorobenzyl)oxy]-1-methyl-ethyl}-3-[3-cyclopentyloxy)-4-methoxybenzyl]-3H-purin-6-amine V11294 Analogue 5f
Type:
Small organic molecule
Emp. Form.:
C28H32ClN5O3
Mol. Mass.:
522.038
SMILES:
COc1ccc(Cn2cnc(N)c3nc(nc23)C(C)(C)OCc2ccc(Cl)cc2)cc1OC1CCCC1
:
Substrate
Name:
BDBM10851
Synonyms:
(4aR,6R,7R,7aS)-6-(6-amino-9H-purin-9-yl)-2,7-dihydroxy-hexahydro-1,3,5,2-furo[3,2-d][1,3,2]dioxaphosphinin-2-one ADENOSINE-3 ,5 -CYCLIC-MONOPHOSPHATE cAMP | cid_23902375
Type:
Small organic molecule
Emp. Form.:
C10H12N5O6P
Mol. Mass.:
329.2059
SMILES:
Nc1ncnc2n(cnc12)[C@@H]1O[C@@H]2COP(O)(=O)O[C@H]2[C@H]1O
: