Target
Bifunctional epoxide hydrolase 2
Ligand
BDBM342655
Substrate
Meas. Tech.
Biochemical Screening Assay
IC50
2.76±n/a nM
Citation
 Mendez-Perez, MBreitschopf, KLorenz, KStrobel, HWang, LSchiffer, AGoerlitzer, J Thienomethylpiperazine derivatives as inhibitors of soluble epoxide hydrolase US Patent  US9776991 Publication Date 10/3/2017 
Target
Name:
Bifunctional epoxide hydrolase 2
Synonyms:
Cytosolic epoxide hydrolase 2 EPHX2 HYES_HUMAN Soluble epoxide hydrolase (sEH) | epoxide hydrolase 2, cytoplasmic
Type:
Enzyme
Mol. Mass.:
62613.07
Organism:
Homo sapiens (Human)
Description:
P34913
Residue:
555
  
Inhibitor
Name:
BDBM342655
Synonyms:
5-[4-(5-tert-Butyl-2-methyl-2H-pyrazole-3-carbonyl)-piperazin-1-ylmethyl]-thiophene-2-carboxylic acid 2-trifluoromethyl-benzyl-amide | US9776991, Example 25
Type:
Small organic molecule
Emp. Form.:
C27H32F3N5O2S
Mol. Mass.:
547.635
SMILES:
Cn1nc(cc1C(=O)N1CCN(Cc2ccc(s2)C(=O)NCc2ccccc2C(F)(F)F)CC1)C(C)(C)C
: