Target
Bifunctional epoxide hydrolase 2
Ligand
BDBM342727
Substrate
Meas. Tech.
Biochemical Screening Assay
IC50
1.60±n/a nM
Citation
 Mendez-Perez, MBreitschopf, KLorenz, KStrobel, HWang, LSchiffer, AGoerlitzer, J Thienomethylpiperazine derivatives as inhibitors of soluble epoxide hydrolase US Patent  US9776991 Publication Date 10/3/2017 
Target
Name:
Bifunctional epoxide hydrolase 2
Synonyms:
Cytosolic epoxide hydrolase 2 EPHX2 HYES_HUMAN Soluble epoxide hydrolase (sEH) | epoxide hydrolase 2, cytoplasmic
Type:
Enzyme
Mol. Mass.:
62613.07
Organism:
Homo sapiens (Human)
Description:
P34913
Residue:
555
  
Inhibitor
Name:
BDBM342727
Synonyms:
5-[4-(3-Methoxy-pyridine-2-carbonyl)-piperazin-1-ylmethyl]-thiophene-2-carboxylic acid 2-trifluoromethoxy-benzylamide | US9776991, Example 97
Type:
Small organic molecule
Emp. Form.:
C25H25F3N4O4S
Mol. Mass.:
534.551
SMILES:
COc1cccnc1C(=O)N1CCN(Cc2ccc(s2)C(=O)NCc2ccccc2OC(F)(F)F)CC1
: