Target
Sodium channel protein type 9 subunit alpha
Ligand
BDBM342862
Substrate
Meas. Tech.
In Vitro PX Assay
IC50
33.0±n/a nM
Citation
 Weiss, MDiMauro, EFDineen, TGraceffa, RGuzman-Perez, AHuang, HKreiman, CMarx, IENguyen, HNPeterson, EADeak, HL Bicyclic sulfonamide compounds as sodium channel inhibitors US Patent  US9776995 Publication Date 10/3/2017 
Target
Name:
Sodium channel protein type 9 subunit alpha
Synonyms:
NENA Peripheral sodium channel 1 SCN9A_HUMAN Voltage-gated sodium channel subunit Nav1.7 hNE-Na
Type:
Protein
Mol. Mass.:
226375.97
Organism:
Homo sapiens (Human)
Description:
Q15858
Residue:
1988
  
Inhibitor
Name:
BDBM342862
Synonyms:
1-(3'-chloro-2-cyano-5-methoxy-4'-methyl-4-biphenylyl)-N-3-isoxazolyl-6-isoquinolinesulfonamide | US9776995, Example 78
Type:
Small organic molecule
Emp. Form.:
C27H19ClN4O4S
Mol. Mass.:
530.982
SMILES:
COc1cc(-c2ccc(C)c(Cl)c2)c(cc1-c1nccc2cc(ccc12)S(=O)(=O)Nc1ccon1)C#N
: