Target
Sodium channel protein type 9 subunit alpha
Ligand
BDBM343202
Substrate
Meas. Tech.
In Vitro PX Assay
IC50
87.0±n/a nM
Citation
 Weiss, MDiMauro, EFDineen, TGraceffa, RGuzman-Perez, AHuang, HKreiman, CMarx, IENguyen, HNPeterson, EADeak, HL Bicyclic sulfonamide compounds as sodium channel inhibitors US Patent  US9776995 Publication Date 10/3/2017 
Target
Name:
Sodium channel protein type 9 subunit alpha
Synonyms:
NENA Peripheral sodium channel 1 SCN9A_HUMAN Voltage-gated sodium channel subunit Nav1.7 hNE-Na
Type:
Protein
Mol. Mass.:
226375.97
Organism:
Homo sapiens (Human)
Description:
Q15858
Residue:
1988
  
Inhibitor
Name:
BDBM343202
Synonyms:
(M)-4-(2-chloro-3''-fluoro-5-methoxy-4-biphenylyl)-3-ethyl-N-3-isoxazolyl-7-cinnolinesulfonamide US9776995, Example 444
Type:
Small organic molecule
Emp. Form.:
C26H20ClFN4O4S
Mol. Mass.:
538.978
SMILES:
CCc1nnc2cc(ccc2c1-c1cc(Cl)c(cc1OC)-c1cccc(F)c1)S(=O)(=O)Nc1ccon1
: