Target
Nitric oxide synthase, inducible
Ligand
BDBM344409
Substrate
Meas. Tech.
Enzyme Assay
Ki
5150±n/a nM
Citation
 Silverman, RBCinelli, MAPensa, AV 2-aminoquinoline-based compounds for potent and selective neuronal nitric oxide synthase inhibition US Patent  US9783500 Publication Date 10/10/2017 
Target
Name:
Nitric oxide synthase, inducible
Synonyms:
HEP-NOS Inducible NO synthase NOS type II NOS2A Nitric oxide synthase, inducible (iNOS) | iNOS
Type:
Homodimer
Mol. Mass.:
131141.95
Organism:
Homo sapiens (Human)
Description:
P35228
Residue:
1153
  
Inhibitor
Name:
BDBM344409
Synonyms:
US9783500, Compound 5
Type:
Small organic molecule
Emp. Form.:
C15H13N3O
Mol. Mass.:
251.2832
SMILES:
Nc1ccc2ccc(COc3cccnc3)cc2n1
: