Target
Nitric oxide synthase, brain
Ligand
BDBM344409
Substrate
Meas. Tech.
Enzyme Assay
Ki
31.0±n/a nM
Citation
 Silverman, RBCinelli, MAPensa, AV 2-aminoquinoline-based compounds for potent and selective neuronal nitric oxide synthase inhibition US Patent  US9783500 Publication Date 10/10/2017 
Target
Name:
Nitric oxide synthase, brain
Synonyms:
Bnos NC-NOS NOS type I nNOS Neuronal nitric oxide synthase Nitric Oxide Synthase, brain Nitric oxide synthase, brain (nNOS) Nitric-oxide synthase, brain (nNOS) Nos1 | Peptidyl-cysteine S-nitrosylase NOS1
Type:
Enzyme
Mol. Mass.:
160570.98
Organism:
Rattus norvegicus (rat)
Description:
Recombinant nNOS overexpressed in E. coli was used in enzyme assays.
Residue:
1429
  
Inhibitor
Name:
BDBM344409
Synonyms:
US9783500, Compound 5
Type:
Small organic molecule
Emp. Form.:
C15H13N3O
Mol. Mass.:
251.2832
SMILES:
Nc1ccc2ccc(COc3cccnc3)cc2n1
: