Target
Serine/threonine-protein kinase Chk1
Ligand
BDBM14632
Substrate
Cdc25C peptide substrate
Meas. Tech.
Chk1 Enzymatic Assay
IC50
64±n/a nM
Citation
 Li, GHasvold, LATao, ZFWang, GTGwaltney, SLPatel, JKovar, PCredo, RBChen, ZZhang, HPark, CSham, HLSowin, TRosenberg, SHLin, NH Synthesis and biological evaluation of 1-(2,4,5-trisubstituted phenyl)-3-(5-cyanopyrazin-2-yl)ureas as potent Chk1 kinase inhibitors. Bioorg Med Chem Lett 16:2293-8 (2006)  
Target
Name:
Serine/threonine-protein kinase Chk1
Synonyms:
CHEK1 CHK1 checkpoint homolog Checkpoint kinase-1 (CHK1)
Type:
Enzyme Catalytic Domain
Mol. Mass.:
54443.02
Organism:
Homo sapiens (Human)
Description:
gi_166295192
Residue:
476
  
Inhibitor
Name:
BDBM14632
Synonyms:
1-{5-chloro-4-[2-({2-[2-(dimethylamino)ethoxy]ethyl}(methyl)amino)ethoxy]-2-(pyrrolidin-1-yl)phenyl}-3-(5-cyanopyrazin-2-yl)urea | N-pyrazinylurea Analog 19c
Type:
Small organic molecule
Emp. Form.:
C25H35ClN8O3
Mol. Mass.:
531.05
SMILES:
CN(C)CCOCCN(C)CCOc1cc(N2CCCC2)c(NC(=O)Nc2cnc(cn2)C#N)cc1Cl
:
Substrate
Name:
Cdc25C peptide substrate
Synonyms:
Type:
Peptide
Mol. Mass.:
2519.88
Organism:
Description:
Cdc25c peptide substrate contained a sequence of amino acid residues 204-225 of human phosphatase Cdc25C.
Residue:
22