Target
Coagulation factor VII
Ligand
BDBM14714
Substrate
BDBM13553
Meas. Tech.
Serine Protease Inhibition Assay
pH
7.8±n/a
Temperature
295.15±n/a K
Ki
0.35±0.11 nM
Citation
 Olivero, AGEigenbrot, CGoldsmith, RRobarge, KArtis, DRFlygare, JRawson, TSutherlin, DPKadkhodayan, SBeresini, MElliott, LODeGuzman, GGBanner, DWUltsch, MMarzec, UHanson, SRRefino, CBunting, SKirchhofer, D A selective, slow binding inhibitor of factor VIIa binds to a nonstandard active site conformation and attenuates thrombus formation in vivo. J Biol Chem 280:9160-9 (2005)  
Target
Name:
Coagulation factor VII
Synonyms:
Eptacog alfa FA7_HUMAN Factor VIIa (fVIIa) SPCA serum prothrombin conversion accelerator
Type:
Enzyme
Mol. Mass.:
51599.89
Organism:
Homo sapiens (Human)
Description:
Residue:
466
  
Inhibitor
Name:
BDBM14714
Synonyms:
(2R)-N-[(3-aminobenzene)sulfonyl]-2-[(4-carbamimidoyl-3-hydroxyphenyl)amino]-2-(3,5-diethoxy-2-fluorophenyl)acetamide R-4-[2-(3-aminobenzenesulfonylamino)-1-(3,5-diethoxy-2-fluorophenyl)-2-oxoethylamino]-2-hydroxy-benzamidine.TFA
Type:
Small organic molecule
Emp. Form.:
C25H28FN5O6S
Mol. Mass.:
545.583
SMILES:
CCOc1cc(OCC)c(F)c(c1)[C@@H](Nc1ccc(C(N)=N)c(O)c1)C(=O)NS(=O)(=O)c1cccc(N)c1
:
Substrate
Name:
BDBM13553
Synonyms:
(2S)-5-carbamimidamido-2-{2-[(2R)-2-methanesulfonamido-3-phenylpropanamido]acetamido}-N-(4-nitrophenyl)pentanamide; acetic acid N-Methylsulfonyl-D-Phe-Gly-Arg-4-nitranilide acetate
Type:
Small organic molecule
Emp. Form.:
C24H32N8O7S
Mol. Mass.:
576.625
SMILES:
CS(=O)(=O)N[C@H](Cc1ccccc1)C(=O)NCC(=O)N[C@@H](CCCNC(N)=N)C(=O)Nc1ccc(cc1)[N+]([O-])=O
: