Target
Coagulation factor X
Ligand
BDBM14714
Substrate
BDBM12658
Meas. Tech.
Serine Protease Inhibition Assay
pH
7.8±n/a
Temperature
295.15±n/a K
Ki
>3500±n/a nM
Citation
 Olivero, AGEigenbrot, CGoldsmith, RRobarge, KArtis, DRFlygare, JRawson, TSutherlin, DPKadkhodayan, SBeresini, MElliott, LODeGuzman, GGBanner, DWUltsch, MMarzec, UHanson, SRRefino, CBunting, SKirchhofer, D A selective, slow binding inhibitor of factor VIIa binds to a nonstandard active site conformation and attenuates thrombus formation in vivo. J Biol Chem 280:9160-9 (2005)  
Target
Name:
Coagulation factor X
Synonyms:
Activated coagulation factor X (FXa) Coagulation factor X precursor F10 Factor X heavy chain Factor Xa Stuart-Prower factor
Type:
Enzyme
Mol. Mass.:
54726.60
Organism:
Homo sapiens (Human)
Description:
Residue:
488
  
Inhibitor
Name:
BDBM14714
Synonyms:
(2R)-N-[(3-aminobenzene)sulfonyl]-2-[(4-carbamimidoyl-3-hydroxyphenyl)amino]-2-(3,5-diethoxy-2-fluorophenyl)acetamide R-4-[2-(3-aminobenzenesulfonylamino)-1-(3,5-diethoxy-2-fluorophenyl)-2-oxoethylamino]-2-hydroxy-benzamidine.TFA
Type:
Small organic molecule
Emp. Form.:
C25H28FN5O6S
Mol. Mass.:
545.583
SMILES:
CCOc1cc(OCC)c(F)c(c1)[C@@H](Nc1ccc(C(N)=N)c(O)c1)C(=O)NS(=O)(=O)c1cccc(N)c1
:
Substrate
Name:
BDBM12658
Synonyms:
4-[({[(1S)-4-carbamimidamido-1-[(4-nitrophenyl)carbamoyl]butyl]carbamoyl}methyl)carbamoyl]-4-[(2S,3S)-3-methyl-2-(phenylformamido)pentanamido]butanoic acid hydrochloride Chromogenic Substrate S-2222 benzoyl-Ile-Glu-Gly-Arg-p-nitroanilide
Type:
Small organic molecule
Emp. Form.:
C32H43N9O9
Mol. Mass.:
697.7387
SMILES:
[#6]-[#6]-[#6@H](-[#6])-[#6@H](-[#7]-[#6](=O)-c1ccccc1)-[#6](=O)-[#7]-[#6@@H](-[#6]-[#6]-[#6](-[#8])=O)-[#6](=O)-[#7]-[#6]-[#6](=O)-[#7]-[#6@@H](-[#6]-[#6]-[#6]\[#7]=[#6](\[#7])-[#7])-[#6](=O)-[#7]-c1ccc(cc1)-[#7+](-[#8-])=O
: