Target
Nuclear receptor coactivator 2 [740-753]
Ligand
BDBM205012
Substrate
Meas. Tech.
Homogeneous Time-Resolved Fluorescence (HTRF) assay
IC50
<100.0±0 nM
Citation
 Xiao, DLi, JZhu, YHu, YWang, HWang, ZWang, ZWei, YSun, YWu, QZhang, HPeng, YKong, FSun, YLuo, HHan, Y Kinase modulating compounds, compositions containing the same and use thereof US Patent  US9550781 Publication Date 1/24/2017 
Target
Name:
Nuclear receptor coactivator 2 [740-753]
Synonyms:
BHLHE75 NCOA2 Nuclear receptor coactivator 2 (aa 740-753) SRC2-3 peptide | TIF2
Type:
fluorescent labeled peptide
Mol. Mass.:
1704.90
Organism:
Description:
Q15596 aa 740-753
Residue:
14
KENALLRYLLDKDD
 
Inhibitor
Name:
BDBM205012
Synonyms:
US9550781, 9 | n-(3-(3-(9h-purin-6-yl)pyridin-2-ylamino)-4-chloro-2-fluorophenyl)-3-fluoropropane-1-sulfonamide
Type:
Small organic molecule
Emp. Form.:
C19H16ClF2N7O2S
Mol. Mass.:
479.891
SMILES:
FCCCS(=O)(=O)Nc1ccc(Cl)c(Nc2ncccc2-c2ncnc3[nH]cnc23)c1F
: