Target
Nuclear receptor coactivator 2 [740-753]
Ligand
BDBM50165873
Substrate
Meas. Tech.
Homogeneous Time-Resolved Fluorescence (HTRF) assay
IC50
<100.0±0 nM
Citation
 Xiao, DLi, JZhu, YHu, YWang, HWang, ZWang, ZWei, YSun, YWu, QZhang, HPeng, YKong, FSun, YLuo, HHan, Y Kinase modulating compounds, compositions containing the same and use thereof US Patent  US9550781 Publication Date 1/24/2017 
Target
Name:
Nuclear receptor coactivator 2 [740-753]
Synonyms:
BHLHE75 NCOA2 Nuclear receptor coactivator 2 (aa 740-753) SRC2-3 peptide | TIF2
Type:
fluorescent labeled peptide
Mol. Mass.:
1704.90
Organism:
Description:
Q15596 aa 740-753
Residue:
14
KENALLRYLLDKDD
 
Inhibitor
Name:
BDBM50165873
Synonyms:
CHEMBL3800014 | US9550781, 19
Type:
Small organic molecule
Emp. Form.:
C18H12F5N7O2S
Mol. Mass.:
485.391
SMILES:
Fc1ccc(NS(=O)(=O)CC(F)(F)F)c(F)c1Nc1ncccc1-c1ncnc2[nH]cnc12
: