Target
Orexin receptor type 2
Ligand
BDBM205101
Substrate
Orexin receptor 1
Meas. Tech.
FLIPR Ca2+ Flux Assay
IC50
10±n/a nM
Citation
 Kuduk, SDSkudlarek, JW 2-pyridyloxy-3-substituted-4-nitrile orexin receptor antagonists US Patent  US9546152 Publication Date 1/17/2017 
Target
Name:
Orexin receptor type 2
Synonyms:
HCRTR2 OX2R_HUMAN Orexin receptor type 2 (OR-2) Orexin receptor type 2 (OX2R) Ox-2-R | Ox2-R
Type:
Protein
Mol. Mass.:
50710.53
Organism:
Homo sapiens (Human)
Description:
O43614
Residue:
444
  
Inhibitor
Name:
BDBM205101
Synonyms:
2-{[(3r,6r)-1-{[2-fluoro-6- (2h-1,2,3-triazol-2- yl)phenyl]carbonyl}-6- methylpiperidin-3-yl]oxy}-3- methylpyridine-4-carbonitrile | US9546152, example 11
Type:
Small organic molecule
Emp. Form.:
C22H21FN6O2
Mol. Mass.:
420.4395
SMILES:
C[C@@H]1CC[C@H](CN1C(=O)c1c(F)cccc1-n1nccn1)Oc1nccc(C#N)c1C
:
Substrate
Name:
Orexin/Hypocretin receptor type 1
Synonyms:
HCRTR1 OX1R_HUMAN Orexin receptor type 1 (OR 1) Orexin receptor type 1 (OX1) Orexin receptor type 1 (OxR1) | Ox1r
Type:
Protein
Mol. Mass.:
47554.50
Organism:
Homo sapiens (Human)
Description:
O43613
Residue:
425