Target
RAC-alpha serine/threonine-protein kinase [139-480,S378A,S381A,T450D,S473D]
Ligand
BDBM15095
Substrate
biotinylated Akt peptide substrate
Meas. Tech.
Akt Kinase Assay
IC50
19±n/a nM
Citation
 Li, QLi, TZhu, GDGong, JClaibone, ADalton, CLuo, YJohnson, EFShi, YLiu, XKlinghofer, VBauch, JLMarsh, KCBouska, JJArries, SDe Jong, ROltersdorf, TStoll, VSJakob, CGRosenberg, SHGiranda, VL Discovery of trans-3,4'-bispyridinylethylenes as potent and novel inhibitors of protein kinase B (PKB/Akt) for the treatment of cancer: Synthesis and biological evaluation. Bioorg Med Chem Lett 16:1679-85 (2006)  
Target
Name:
RAC-alpha serine/threonine-protein kinase [139-480,S378A,S381A,T450D,S473D]
Synonyms:
AKT1 C-AKT Protein kinase B (Akt 1) RAC | RAC-PK-alpha
Type:
Enzyme
Mol. Mass.:
39513.28
Organism:
Homo sapiens (Human)
Description:
Recombinant His-tagged Akt1 (S378A, S381A, T450D, S473D; 139-480)
Residue:
342
  
Inhibitor
Name:
BDBM15095
Synonyms:
N-[(2S)-2-amino-3-(1H-indol-3-yl)propyl]-6-chloro-5-[(E)-2-(pyridin-4-yl)ethenyl]pyridin-3-amine | trans-bispyridinylethylene analog 16a
Type:
Small organic molecule
Emp. Form.:
C23H22ClN5
Mol. Mass.:
403.907
SMILES:
N[C@H](CNc1cnc(Cl)c(\C=C\c2ccncc2)c1)Cc1c[nH]c2ccccc12
:
Substrate
Name:
biotinylated Akt peptide substrate
Synonyms:
Type:
Biotinylated Peptide
Mol. Mass.:
3178.04
Organism:
Description:
Km=15 uM
Residue:
28