Target
A-kinase anchor protein 7 isoform gamma
Ligand
BDBM212601
Substrate
Meas. Tech.
Binding Assay
EC50
60500±0 nM
Citation
 Tasken, KLygren, BOstensen, EKlaveness, J Tertiary amines for use in the treatment of cardiac disorders US Patent  US9556111 Publication Date 1/31/2017 
Target
Name:
A-kinase anchor protein 7 isoform gamma
Synonyms:
A-kinase anchor protein 18 kDa AKAP 18 AKAP18 PRKA7 isoform gamma | Protein kinase A-anchoring protein 7 isoform gamma
Type:
Protein
Mol. Mass.:
39515.45
Organism:
Homo sapiens (Human)
Description:
Q9P0M2
Residue:
348
  
Inhibitor
Name:
BDBM212601
Synonyms:
US9556111, Table 1.6 | US9951033, Compound Table 1.8
Type:
Small organic molecule
Emp. Form.:
C20H16F4N2O2S
Mol. Mass.:
424.412
SMILES:
OC(=O)c1csc(CN(Cc2ccc(F)cc2)Cc2cccc(c2)C(F)(F)F)n1
: