Target
Dipeptidyl peptidase 4
Ligand
BDBM15471
Substrate
BDBM11057
Meas. Tech.
DPP Inhibition Assay
pH
7.5±n/a
Temperature
295.15±n/a K
IC50
5±n/a nM
Citation
 Sheehan, SMMest, HJWatson, BMKlimkowski, VJTimm, DECauvin, AParsons, SHShi, QCanada, EJWiley, MRRuehter, GEvers, BPetersen, SBlaszczak, LCPulley, SRMargolis, BJWishart, GNRenson, BHankotius, DMohr, MZechel, JCMichael Kalbfleisch, JDingess-Hammond, EABoelke, AWeichert, AG Discovery of non-covalent dipeptidyl peptidase IV inhibitors which induce a conformational change in the active site. Bioorg Med Chem Lett 17:1765-8 (2007)  
Target
Name:
Dipeptidyl peptidase 4
Synonyms:
ADABP Adenosine deaminase complexing protein 2 CD_antigen=CD26 DPP4 DPPIV Dipeptidyl peptidase 4 (DPP IV) Dipeptidyl peptidase 4 (DPP4) Dipeptidyl peptidase 4 membrane form Dipeptidyl peptidase IV Dipeptidyl peptidase IV (DDP-IV) Dipeptidyl peptidase IV membrane form Dipeptidyl peptidase-IV (DPP-4) T-cell activation antigen CD26 | TP103
Type:
Enzyme
Mol. Mass.:
88271.01
Organism:
Homo sapiens (Human)
Description:
P27487
Residue:
766
  
Inhibitor
Name:
BDBM15471
Synonyms:
4-[(1-{[2-oxo-2-(thiophen-3-yl)ethyl]amino}cyclopentyl)methoxy]benzamide | alpha-amino ketone deriv. 12
Type:
Small organic molecule
Emp. Form.:
C19H22N2O3S
Mol. Mass.:
358.455
SMILES:
NC(=O)c1ccc(OCC2(CCCC2)NCC(=O)c2ccsc2)cc1
:
Substrate
Name:
BDBM11057
Synonyms:
1-(2-aminoacetyl)-N-(4-methyl-2-oxo-2H-chromen-7-yl)pyrrolidine-2-carboxamide hydrobromide Gly-Pro-7-amidomethylcoumarin | Gly-Pro-AMC
Type:
Small organic molecule
Emp. Form.:
C17H19N3O4
Mol. Mass.:
329.3505
SMILES:
Cc1cc(=O)oc2cc(NC(=O)C3CCCN3C(=O)CN)ccc12
: