Target
Dipeptidyl peptidase 4
Ligand
BDBM15556
Substrate
BDBM11057
Meas. Tech.
Dipeptidyl Peptidase Inhibition Assay
IC50
139±n/a nM
Citation
 Liang, GBQian, XFeng, DBiftu, TEiermann, GHe, HLeiting, BLyons, KPetrov, ASinha-Roy, RZhang, BWu, JZhang, XThornberry, NAWeber, AE Optimization of 1,4-diazepan-2-one containing dipeptidyl peptidase IV inhibitors for the treatment of type 2 diabetes. Bioorg Med Chem Lett 17:1903-7 (2007)  
Target
Name:
Dipeptidyl peptidase 4
Synonyms:
ADABP Adenosine deaminase complexing protein 2 CD_antigen=CD26 DPP4 DPPIV Dipeptidyl peptidase 4 (DPP IV) Dipeptidyl peptidase 4 (DPP4) Dipeptidyl peptidase 4 membrane form Dipeptidyl peptidase IV Dipeptidyl peptidase IV (DDP-IV) Dipeptidyl peptidase IV membrane form Dipeptidyl peptidase-IV (DPP-4) T-cell activation antigen CD26 | TP103
Type:
Enzyme
Mol. Mass.:
88271.01
Organism:
Homo sapiens (Human)
Description:
P27487
Residue:
766
  
Inhibitor
Name:
BDBM15556
Synonyms:
(3R,7R)-4-[(3R)-3-amino-4-(2,4,5-trifluorophenyl)butanoyl]-3-methyl-7-(trifluoromethyl)-1,4-diazepan-2-one | 7-substituted diazepanone 15g
Type:
Small organic molecule
Emp. Form.:
C17H19F6N3O2
Mol. Mass.:
411.3421
SMILES:
C[C@H]1N(CC[C@@H](NC1=O)C(F)(F)F)C(=O)C[C@H](N)Cc1cc(F)c(F)cc1F
:
Substrate
Name:
BDBM11057
Synonyms:
1-(2-aminoacetyl)-N-(4-methyl-2-oxo-2H-chromen-7-yl)pyrrolidine-2-carboxamide hydrobromide Gly-Pro-7-amidomethylcoumarin | Gly-Pro-AMC
Type:
Small organic molecule
Emp. Form.:
C17H19N3O4
Mol. Mass.:
329.3505
SMILES:
Cc1cc(=O)oc2cc(NC(=O)C3CCCN3C(=O)CN)ccc12
: