Target
Dipeptidyl peptidase 2
Ligand
BDBM15549
Substrate
BDBM11156
Meas. Tech.
Dipeptidyl Peptidase Inhibition Assay
IC50
31000±n/a nM
Citation
 Liang, GBQian, XFeng, DBiftu, TEiermann, GHe, HLeiting, BLyons, KPetrov, ASinha-Roy, RZhang, BWu, JZhang, XThornberry, NAWeber, AE Optimization of 1,4-diazepan-2-one containing dipeptidyl peptidase IV inhibitors for the treatment of type 2 diabetes. Bioorg Med Chem Lett 17:1903-7 (2007)  
Target
Name:
Dipeptidyl peptidase 2
Synonyms:
DAP II DPP2_HUMAN Dipeptidyl aminopeptidase II Dipeptidyl peptidase 2 (DPP2) Dipeptidyl peptidase II (DPP II) Dipeptidyl peptidase II and dipeptidyl peptidase IV (DPP2 and DPP4) carboxytripeptidase dipeptidyl(amino)peptidase II | dipeptidylarylamidase
Type:
Protein
Mol. Mass.:
54339.29
Organism:
Homo sapiens (Human)
Description:
Q9UHL4
Residue:
492
  
Inhibitor
Name:
BDBM15549
Synonyms:
(3R,6S)-4-[(3R)-3-amino-4-(2,4,5-trifluorophenyl)butanoyl]-6-methyl-3-(2,2,2-trifluoroethyl)-1,4-diazepan-2-one | 6-methyl diazepanone 14e
Type:
Small organic molecule
Emp. Form.:
C18H21F6N3O2
Mol. Mass.:
425.3687
SMILES:
C[C@H]1CNC(=O)[C@@H](CC(F)(F)F)N(C1)C(=O)C[C@H](N)Cc1cc(F)c(F)cc1F
:
Substrate
Name:
BDBM11156
Synonyms:
1-(2-aminohexanoyl)-N-(4-methyl-2-oxo-2H-chromen-7-yl)pyrrolidine-2-carboxamide Nle-Pro-AMC
Type:
Emp. Form.:
Mol. Mass.:
SMILES:
: