Target
Interleukin-1 receptor-associated kinase 1 [194-712]
Ligand
BDBM348007
Substrate
Meas. Tech.
Enzymatic Assay
IC50
550±n/a nM
Citation
 Jorand-Lebrun, CJones, RWon, ACNguyen, NJohnson, TLDeselm, LCPanda, K Heteroaryl compounds as IRAK inhibitors and uses thereof US Patent  US9790221 Publication Date 10/17/2017 
Target
Name:
Interleukin-1 receptor-associated kinase 1 [194-712]
Synonyms:
IRAK IRAK1_HUMAN | Interleukin-1 receptor-associated kinase 1 (IRAK1)
Type:
Enzyme Catalytic Domain
Mol. Mass.:
55943.99
Organism:
Homo sapiens (Human)
Description:
aa 194-712
Residue:
519
  
Inhibitor
Name:
BDBM348007
Synonyms:
US9790221, Compound 215
Type:
Small organic molecule
Emp. Form.:
C26H29N7O2S
Mol. Mass.:
503.619
SMILES:
Cc1ccc(cn1)-c1cnc(nc1NC1CCN(CC1)S(C)(=O)=O)-c1cccc(c1)-c1cnn(C)c1
: