Target
P2X purinoceptor 7
Ligand
BDBM160085
Substrate
Meas. Tech.
Radioligand binding assay
Ki
1.000±n/a nM
Citation
 Ameriks, MKRech, JCSavall, BM Substituted [1,2,4]triazolo[4,3-a]pyrazines as P2X7 modulators US Patent  US10047092 Publication Date 8/14/2018 
Target
Name:
P2X purinoceptor 7
Synonyms:
ATP receptor P2X purinoceptor 7 P2X purinoceptor 7 (P2X7) P2X7 rat P2rx7 | Purinergic receptor
Type:
Protein
Mol. Mass.:
68403.50
Organism:
Rattus norvegicus (Rat)
Description:
Q64663
Residue:
595
  
Inhibitor
Name:
BDBM160085
Synonyms:
US10047092, 26 US9040534, 26
Type:
Small organic molecule
Emp. Form.:
C18H16ClF3N6O
Mol. Mass.:
424.807
SMILES:
C[C@H]1Cn2c(nnc2C(=O)N1Cc1cccc(c1Cl)C(F)(F)F)-c1cc(C)[nH]n1
: