Target
P2X purinoceptor 7
Ligand
BDBM160091
Substrate
Meas. Tech.
Ca2+ flux assay
pH
7.4±n/a
IC50
0.200±n/a nM
Comments
extracted
Citation
 Ameriks, MKRech, JCSavall, BM Substituted [1,2,4]triazolo[4,3-a]pyrazines as P2X7 modulators US Patent  US10047092 Publication Date 8/14/2018 
Target
Name:
P2X purinoceptor 7
Synonyms:
ATP receptor P2RX7_HUMAN P2X purinoceptor 7 (P2X7) P2Z receptor | Purinergic receptor
Type:
Protein
Mol. Mass.:
68602.85
Organism:
Homo sapiens (Human)
Description:
Q99572
Residue:
595
  
Inhibitor
Name:
BDBM160091
Synonyms:
US10047092, 32 US9040534, 32
Type:
Small organic molecule
Emp. Form.:
C17H13ClF3N5OS
Mol. Mass.:
427.831
SMILES:
C[C@H]1Cn2c(nnc2C(=O)N1Cc1cccc(c1Cl)C(F)(F)F)-c1cscn1
: