Target
P2X purinoceptor 7
Ligand
BDBM160093
Substrate
Meas. Tech.
Radioligand binding assay
Ki
2.50±n/a nM
Citation
 Ameriks, MKRech, JCSavall, BM Substituted [1,2,4]triazolo[4,3-a]pyrazines as P2X7 modulators US Patent  US10047092 Publication Date 8/14/2018 
Target
Name:
P2X purinoceptor 7
Synonyms:
ATP receptor P2RX7_HUMAN P2X purinoceptor 7 (P2X7) P2Z receptor | Purinergic receptor
Type:
Protein
Mol. Mass.:
68602.85
Organism:
Homo sapiens (Human)
Description:
Q99572
Residue:
595
  
Inhibitor
Name:
BDBM160093
Synonyms:
US10047092, 34 US9040534, 34
Type:
Small organic molecule
Emp. Form.:
C18H13ClF4N6O
Mol. Mass.:
440.782
SMILES:
C[C@H]1Cn2c(nnc2-c2ncc(F)cn2)C(=O)N1Cc1cccc(c1Cl)C(F)(F)F
: