Target
Cathepsin D
Ligand
BDBM16050
Substrate
Cathepsin D Peptide Substrate
Meas. Tech.
Enzyme Inhibition Measurements
Temperature
298.15±n/a K
IC50
60±n/a nM
Comments
extracted
Citation
 Hanessian, SYun, HHou, YYang, GBayrakdarian, MTherrien, EMoitessier, NRoggo, SVeenstra, STintelnot-Blomley, MRondeau, JMOstermeier, CStrauss, ARamage, PPaganetti, PNeumann, UBetschart, C Structure-based design, synthesis, and memapsin 2 (BACE) inhibitory activity of carbocyclic and heterocyclic peptidomimetics. J Med Chem 48:5175-90 (2005)  
Target
Name:
Cathepsin D
Synonyms:
CATD_HUMAN CTSD Cathepsin D heavy chain Cathepsin D precursor
Type:
Enzyme
Mol. Mass.:
44551.72
Organism:
Homo sapiens (Human)
Description:
Human proCathepsin D (SwissProt accession number P07339) was expressed in Sf9 cells, purified, and autoactivated.
Residue:
412
  
Inhibitor
Name:
BDBM16050
Synonyms:
(2S)-2-[(2S)-2-{[(1R,2R)-2-[(1S,2S)-2-[(2S)-2-[(2S)-2-[(4S)-4-amino-4-formamidobutanoic acid]-3-methylbutanamido]butanediamido]-1-hydroxy-4-methylpentyl]cyclopentyl]formamido}propanamido]pentanedioic acid truncated OM99-2 cyclopentano analog 4
Type:
Small organic molecule
Emp. Form.:
C34H57N7O13
Mol. Mass.:
771.8555
SMILES:
[H][C@]1(CCC[C@H]1C(=O)N[C@@H](C)C(=O)N[C@@H](CCC(O)=O)C(O)=O)[C@H](O)[C@H](CC(C)C)NC(=O)[C@H](CC(N)=O)NC(=O)[C@@H](NC(=O)[C@@H](N)CCC(O)=O)C(C)C
:
Substrate
Name:
Cathepsin D Peptide Substrate
Synonyms:
Type:
Peptide
Mol. Mass.:
2375.29
Organism:
Description:
Peptide substrates were obtained from Bachem (Bubendorf, Switzerland).
Residue:
20