Target
Tissue-type plasminogen activator
Ligand
BDBM16142
Substrate
BDBM14715
Meas. Tech.
Determination of Inhibitor Potency and Selectivity
Ki
>100000±n/a nM
Citation
 Fish, PVBarber, CGBrown, DGButt, RCollis, MGDickinson, RPHenry, BTHorne, VAHuggins, JPKing, EO'gara, MMcCleverty, DMcIntosh, FPhillips, CWebster, R Selective Urokinase-Type Plasminogen Activator Inhibitors. 4. 1-(7-Sulfonamidoisoquinolinyl)guanidines. J Med Chem 50:2341-51 (2007)  
Target
Name:
Tissue-type plasminogen activator
Synonyms:
Alteplase Reteplase Thrombin receptor protein Tissue-type plasminogen activator (tPA) t-PA t-plasminogen activator
Type:
Enzyme
Mol. Mass.:
62931.08
Organism:
Homo sapiens (Human)
Description:
Residue:
562
  
Inhibitor
Name:
BDBM16142
Synonyms:
2-({4-chloro-1-[(diaminomethylidene)amino]isoquinoline-7-}(methyl)sulfonamido)acetic acid | substituted glycine deriv. 16
Type:
Small organic molecule
Emp. Form.:
C13H14ClN5O4S
Mol. Mass.:
371.799
SMILES:
[#6]-[#7](-[#6]-[#6](-[#8])=O)S(=O)(=O)c1ccc2c(Cl)cnc(\[#7]=[#6](/[#7])-[#7])c2c1
:
Substrate
Name:
BDBM14715
Synonyms:
(2S)-2-{[(2S)-1-[(2R,3R)-2-amino-3-methylpentanoyl]pyrrolidin-2-yl]formamido}-5-carbamimidamido-N-(4-nitrophenyl)pentanamide dihydrochloride H-D-Isoleucyl-L-prolyl-L-arginine-pnitroaniline dihydrochloride
Type:
Small organic molecule
Emp. Form.:
C23H36N8O5
Mol. Mass.:
504.5825
SMILES:
CC[C@@H](C)[C@@H](N)C(=O)N1CCC[C@H]1C(=O)N[C@@H](CCCNC(N)=N)C(=O)Nc1ccc(cc1)[N+]([O-])=O
: