Target
Plasminogen
Ligand
BDBM16149
Substrate
BDBM12679
Meas. Tech.
Determination of Inhibitor Potency and Selectivity
Ki
45000±n/a nM
Citation
 Fish, PVBarber, CGBrown, DGButt, RCollis, MGDickinson, RPHenry, BTHorne, VAHuggins, JPKing, EO'gara, MMcCleverty, DMcIntosh, FPhillips, CWebster, R Selective Urokinase-Type Plasminogen Activator Inhibitors. 4. 1-(7-Sulfonamidoisoquinolinyl)guanidines. J Med Chem 50:2341-51 (2007)  
Target
Name:
Plasminogen
Synonyms:
Activation peptide PLG Plasmin Plasmin heavy chain A, short form | Plasmin light chain B
Type:
Enzyme
Mol. Mass.:
90579.18
Organism:
Homo sapiens (Human)
Description:
Residue:
810
  
Inhibitor
Name:
BDBM16149
Synonyms:
(2S)-2-({4-chloro-1-[(diaminomethylidene)amino]isoquinoline-7-}sulfonamido)-3-methylbutanoic acid | substituted glycine deriv. 23
Type:
Small organic molecule
Emp. Form.:
C15H18ClN5O4S
Mol. Mass.:
399.853
SMILES:
[#6]-[#6](-[#6])-[#6@H](-[#7]S(=O)(=O)c1ccc2c(Cl)cnc(\[#7]=[#6](/[#7])-[#7])c2c1)-[#6](-[#8])=O
:
Substrate
Name:
BDBM12679
Synonyms:
BDBM13790 Chromogenic Substrate
Type:
Small organic molecule
Emp. Form.:
C26H34N6O7S
Mol. Mass.:
574.649
SMILES:
Cc1ccc(cc1)S(=O)(=O)NCC(=O)N1CCCC1C(=O)NC(CCCCN)C(=O)Nc1ccc(cc1)[N+]([O-])=O
: