Target
Ephrin type-B receptor 4
Ligand
BDBM351430
Substrate
Meas. Tech.
AlphaScreen Assay
IC50
525±n/a nM
Citation
 Rice, KDAnand, NKBussenius, JCostanzo, SKennedy, ARPeto, CJTsang, THBlazey, CM Substituted quinazolines as receptor-type kinase inhibitors US Patent  US9796704 Publication Date 10/24/2017 
Target
Name:
Ephrin type-B receptor 4
Synonyms:
EPHB4 Ephrin receptor HTK MYK1 Tyrosine-protein kinase TYRO11 | VHL/Ephrin type-B receptor 4
Type:
Enzyme
Mol. Mass.:
108273.51
Organism:
Homo sapiens (Human)
Description:
P54760
Residue:
987
  
Inhibitor
Name:
BDBM351430
Synonyms:
N-(3,4-dichlorophenyl)-6-(methyloxy)-7-[({2- [(4-methylpiperazin-1-yl)methyl]-1,3-thiazol- 4-yl}methyl)oxy]quinazolin-4-amine | US9796704, Entry 150
Type:
Small organic molecule
Emp. Form.:
C24H25Cl2N7O2S
Mol. Mass.:
546.472
SMILES:
COc1cc2c(Nc3ccc(Cl)c(Cl)c3)ncnc2cc1OCc1nsc(CN2CCN(C)CC2)n1
: