Target
Vascular endothelial growth factor receptor 2
Ligand
BDBM351430
Substrate
Meas. Tech.
AlphaScreen Assay
IC50
525±n/a nM
Citation
 Rice, KDAnand, NKBussenius, JCostanzo, SKennedy, ARPeto, CJTsang, THBlazey, CM Substituted quinazolines as receptor-type kinase inhibitors US Patent  US9796704 Publication Date 10/24/2017 
Target
Name:
Vascular endothelial growth factor receptor 2
Synonyms:
CD_antigen=CD309 Fetal liver kinase 1 (FLK-1) KDR Protein-tyrosine kinase receptor Flk-1 VEGFR-2 VEGFR2 Vascular Endothelial Growth Factor Receptor Kinase 2 Vascular endothelial growth factor receptor 2 (KDR) Vascular endothelial growth factor receptor 2 (VEGFR2) Vascular endothelial growth factor receptor-2 (VEGFR-2)
Type:
Receptor Tyrosine Kinase
Mol. Mass.:
151510.97
Organism:
Homo sapiens (Human)
Description:
P35968
Residue:
1356
  
Inhibitor
Name:
BDBM351430
Synonyms:
N-(3,4-dichlorophenyl)-6-(methyloxy)-7-[({2- [(4-methylpiperazin-1-yl)methyl]-1,3-thiazol- 4-yl}methyl)oxy]quinazolin-4-amine | US9796704, Entry 150
Type:
Small organic molecule
Emp. Form.:
C24H25Cl2N7O2S
Mol. Mass.:
546.472
SMILES:
COc1cc2c(Nc3ccc(Cl)c(Cl)c3)ncnc2cc1OCc1nsc(CN2CCN(C)CC2)n1
: