Target
Tyrosine-protein kinase BTK
Ligand
BDBM351884
Substrate
Meas. Tech.
Fluorescence Polarization-Based Kinase Assay
Ki
<100±n/a nM
Citation
 Laurent, ARose, YJaquith, JB Selective inhibitors of Tec and Src protein kinase families US Patent  US9796716 Publication Date 10/24/2017 
Target
Name:
Tyrosine-protein kinase BTK
Synonyms:
AGMX1 Agammaglobulinaemia tyrosine kinase B cell progenitor kinase BPK BTK_HUMAN Tyrosine Kinase BTK Tyrosine-protein kinase BTK (BTK)
Type:
Enzyme
Mol. Mass.:
76289.95
Organism:
Homo sapiens (Human)
Description:
Q06187
Residue:
659
  
Inhibitor
Name:
BDBM351884
Synonyms:
US9796716, Compound 129
Type:
Small organic molecule
Emp. Form.:
C27H26FN7O2
Mol. Mass.:
499.5394
SMILES:
Cc1ncc(COc2cc(F)cc(Oc3ccc(cc3)-c3nn(c4ncnc(N)c34)C(C)(C)C)c2)cn1
: