Target
Carbonic anhydrase 4
Ligand
BDBM11618
Substrate
BDBM11326
Meas. Tech.
Esterase Assay
Ki
4±n/a nM
Citation
 Vullo, DFranchi, MGallori, EAntel, JScozzafava, ASupuran, CT Carbonic anhydrase inhibitors. Inhibition of mitochondrial isozyme V with aromatic and heterocyclic sulfonamides. J Med Chem 47:1272-9 (2004)  
Target
Name:
Carbonic anhydrase 4
Synonyms:
CA-IV CAH4_BOVIN Carbonic Anhydrase IV Carbonic anhydrase 4
Type:
Enzyme
Mol. Mass.:
35152.74
Organism:
Bos taurus (bovine)
Description:
Bovine isozyme, isolated from lung microsomes
Residue:
312
  
Inhibitor
Name:
BDBM11618
Synonyms:
5-(4-Acetamido-3-bromobenzenesulfonamido)-1,3,4-thiadiazole-2-sulfonamide aminobenzolamide 16d | aminobenzolamide deriv. 42
Type:
Small organic molecule
Emp. Form.:
C10H10BrN5O5S3
Mol. Mass.:
456.316
SMILES:
CC(=O)Nc1ccc(cc1Br)S(=O)(=O)Nc1nnc(s1)S(N)(=O)=O
:
Substrate
Name:
BDBM11326
Synonyms:
4-nitrophenyl acetate | p-Nitrophenyl Acetate
Type:
Small organic molecule
Emp. Form.:
C8H7NO4
Mol. Mass.:
181.1455
SMILES:
CC(=O)Oc1ccc(cc1)[N+]([O-])=O
: