Target
Carbonic anhydrase 5A, mitochondrial
Ligand
BDBM10880
Substrate
BDBM10856
Meas. Tech.
Esterase Assay
Ki
58±n/a nM
Citation
 Vullo, DFranchi, MGallori, EAntel, JScozzafava, ASupuran, CT Carbonic anhydrase inhibitors. Inhibition of mitochondrial isozyme V with aromatic and heterocyclic sulfonamides. J Med Chem 47:1272-9 (2004)  
Target
Name:
Carbonic anhydrase 5A, mitochondrial
Synonyms:
CAH5A_MOUSE Ca5a Car5a Carbonic Anhydrase V Carbonic anhydrase 5A, mitochondrial precursor
Type:
Enzyme
Mol. Mass.:
34081.17
Organism:
Mus musculus (mouse)
Description:
Full length murine, cloned isozyme.
Residue:
299
  
Inhibitor
Name:
BDBM10880
Synonyms:
AZA AZM acetazolamide Acetazolamide Acetazolamide (AZA) Acetazolamide, 5 Acetazolamide, AZA CHEMBL20 Sulfonamide, 1 US11278534, Example acetazolamide sulfonamide 1
Type:
Small organic molecule
Emp. Form.:
C4H6N4O3S2
Mol. Mass.:
222.245
SMILES:
CC(=O)Nc1nnc(s1)S(N)(=O)=O
:
Substrate
Name:
BDBM10856
Synonyms:
Carbon Dioxide | methanedione
Type:
Small organic molecule
Emp. Form.:
CO2
Mol. Mass.:
44.0095
SMILES:
O=C=O
: