Target
Tyrosine-protein kinase BTK
Ligand
BDBM166569
Substrate
Meas. Tech.
Enzyme Assay
IC50
0.190±n/a nM
Citation
 Liu, QWatterson, SHAhmad, STebben, AJ Indole carboxamide compounds US Patent  US9802915 Publication Date 10/31/2017 
Target
Name:
Tyrosine-protein kinase BTK
Synonyms:
AGMX1 Agammaglobulinaemia tyrosine kinase B cell progenitor kinase BPK BTK_HUMAN Tyrosine Kinase BTK Tyrosine-protein kinase BTK (BTK)
Type:
Enzyme
Mol. Mass.:
76289.95
Organism:
Homo sapiens (Human)
Description:
Q06187
Residue:
659
  
Inhibitor
Name:
BDBM166569
Synonyms:
US10604504, Example 219 US9688629, 217 US9688629, 219 US9920031, Example 219
Type:
Small organic molecule
Emp. Form.:
C19H22FN3O2
Mol. Mass.:
343.3953
SMILES:
Cc1[nH]c2c(cc(F)c(C3CCCN(C3)C(=O)C=C)c2c1C)C(N)=O
: