Target
Beta-secretase 1
Ligand
BDBM16705
Substrate
BACE Substrate Peptide
Meas. Tech.
In Vitro BACE1 Activity Assay
pH
4.5±n/a
Temperature
295.15±n/a K
IC50
9900±n/a nM
Citation
 Katharine Holloway, MMcGaughey, GBCoburn, CAStachel, SJJones, KGStanton, ELGregro, ARLai, MTCrouthamel, MCPietrak, BLMunshi, SK Evaluating scoring functions for docking and designing beta-secretase inhibitors. Bioorg Med Chem Lett 17:823-7 (2007)  
Target
Name:
Beta-secretase 1
Synonyms:
ASP2 Aspartyl protease 2 BACE1 Beta-secretase (BACE) Beta-secretase 1 (BACE 1) Beta-secretase 1 (BACE1) Beta-site amyloid precursor protein cleaving enzyme 1 Memapsin-2 beta-Secretase (BACE-1) | beta-Secretase (BACE1)
Type:
Protein
Mol. Mass.:
55755.10
Organism:
Homo sapiens (Human)
Description:
P56817
Residue:
501
  
Inhibitor
Name:
BDBM16705
Synonyms:
5-(2-acetylphenyl)-1-N-[(2S)-1-hydroxy-3-phenylpropan-2-yl]-3-N-[(1R)-1-phenylethyl]benzene-1,3-dicarboxamide | Peptidomimetic HEA inhibitor, 14
Type:
Small organic molecule
Emp. Form.:
C33H32N2O4
Mol. Mass.:
520.6182
SMILES:
C[C@@H](NC(=O)c1cc(cc(c1)-c1ccccc1C(C)=O)C(=O)N[C@H](CO)Cc1ccccc1)c1ccccc1
:
Substrate
Name:
BACE Substrate Peptide
Synonyms:
BACE-1 Substrate Peptide
Type:
Peptide
Mol. Mass.:
1557.77
Organism:
Description:
It is a coumarin (CM)-labeled peptide containing an optimized cleavage sequence NFEV.
Residue:
12
CMREVNFEVEFR