Target
Receptor tyrosine-protein kinase erbB-2
Ligand
BDBM228117
Substrate
Receptor tyrosine-protein kinase erbB-2
Meas. Tech.
Kinase Assay
pH
7.5±n/a
Temperature
298.15±n/a K
IC50
1.70±n/a nM
Comments
extracted
Citation
 Zhang, YLiu, BLiu, JZhang, JCheng, C Aminoquinazoline derivatives and their salts and methods of use thereof US Patent  US9556191 Publication Date 1/31/2017 
Target
Name:
Receptor tyrosine-protein kinase erbB-2
Synonyms:
2.7.10.1 CD_antigen=CD340 ERBB2_HUMAN FASN/HER2 HER2 MLN19 NEU Proto-oncogene Neu Tyrosine kinase-type cell surface receptor HER2 | p185erbB2
Type:
Mol. Mass.:
137894.47
Organism:
Homo sapiens (Human)
Description:
P04626
Residue:
1255
  
Inhibitor
Name:
BDBM228117
Synonyms:
(e)-n-(4-((3-chloro-4-(pyridin-2-ylmethoxy)phenyl)amino)-7-ethoxyquinazolin-6-yl)-4-((4ar,7as)-tetrahydro-2h-[1,4]dioxino[2,3-c]pyrrol-6(3h)-yl)but-2-enamide | US9556191, example 24
Type:
Small organic molecule
Emp. Form.:
C32H33ClN6O5
Mol. Mass.:
617.095
SMILES:
CCOc1cc2ncnc(Nc3ccc(OCc4ccccn4)c(Cl)c3)c2cc1NC(=O)\C=C\CN1C[C@H]2OCCO[C@H]2C1
:
Substrate
Name:
Receptor tyrosine-protein kinase erbB-2
Synonyms:
2.7.10.1 CD_antigen=CD340 ERBB2_HUMAN FASN/HER2 HER2 MLN19 NEU Proto-oncogene Neu Tyrosine kinase-type cell surface receptor HER2 | p185erbB2
Type:
Mol. Mass.:
137894.47
Organism:
Homo sapiens (Human)
Description:
P04626
Residue:
1255