Target
Pepsin A-4
Ligand
BDBM16752
Substrate
Cathepsin D/Pepsin Peptide Substrate
Meas. Tech.
FRET-based Peptide Cleavage Assay
pH
4.5±n/a
Temperature
295.15±n/a K
IC50
>50000±n/a nM
Citation
 Cole, DCManas, ESStock, JRCondon, JSJennings, LDAulabaugh, AChopra, RCowling, REllingboe, JWFan, KYHarrison, BLHu, YJacobsen, SJin, GLin, LLovering, FEMalamas, MSStahl, MLStrand, JSukhdeo, MNSvenson, KTurner, MJWagner, EWu, JZhou, PBard, J Acylguanidines as small-molecule beta-secretase inhibitors. J Med Chem 49:6158-61 (2006)  
Target
Name:
Pepsin A-4
Synonyms:
PEPA4_HUMAN Pepsin
Type:
Enzyme
Mol. Mass.:
41954.51
Organism:
Homo sapiens (Human)
Description:
Residue:
388
  
Inhibitor
Name:
BDBM16752
Synonyms:
2-[2-(adamantan-1-yl)-5-phenyl-1H-pyrrol-1-yl]-N-(diaminomethylidene)acetamide | Acylguanidine, 7b
Type:
Small organic molecule
Emp. Form.:
C23H28N4O
Mol. Mass.:
376.4946
SMILES:
NC(=N)NC(=O)Cn1c(ccc1C12CC3CC(CC(C3)C1)C2)-c1ccccc1
:
Substrate
Name:
Cathepsin D/Pepsin Peptide Substrate
Synonyms:
Type:
Peptide
Mol. Mass.:
2478.43
Organism:
Description:
Residue:
21