Target
Nuclear receptor coactivator 2 [740-753]
Ligand
BDBM228129
Substrate
Meas. Tech.
Competitive Binding Assay
IC50
26600±n/a nM
Citation
 Tanis, SPLarsen, SDArtman, III, GDParker, T PPAR-sparing compounds for the treatment of metabolic diseases US Patent  US9562012 Publication Date 2/7/2017 
Target
Name:
Nuclear receptor coactivator 2 [740-753]
Synonyms:
BHLHE75 NCOA2 Nuclear receptor coactivator 2 (aa 740-753) SRC2-3 peptide | TIF2
Type:
fluorescent labeled peptide
Mol. Mass.:
1704.90
Organism:
Description:
Q15596 aa 740-753
Residue:
14
KENALLRYLLDKDD
 
Inhibitor
Name:
BDBM228129
Synonyms:
US9562012, mitoglitazone
Type:
Small organic molecule
Emp. Form.:
C19H18N2O4S
Mol. Mass.:
370.422
SMILES:
CCc1ccc(nc1)C(=O)COc1ccc(CC2SC(=O)NC2=O)cc1
: