Target
Nuclear receptor coactivator 2 [740-753]
Ligand
BDBM228133
Substrate
Meas. Tech.
Competitive Binding Assay
IC50
>250000±n/a nM
Citation
 Tanis, SPLarsen, SDArtman, III, GDParker, T PPAR-sparing compounds for the treatment of metabolic diseases US Patent  US9562012 Publication Date 2/7/2017 
Target
Name:
Nuclear receptor coactivator 2 [740-753]
Synonyms:
BHLHE75 NCOA2 Nuclear receptor coactivator 2 (aa 740-753) SRC2-3 peptide | TIF2
Type:
fluorescent labeled peptide
Mol. Mass.:
1704.90
Organism:
Description:
Q15596 aa 740-753
Residue:
14
KENALLRYLLDKDD
 
Inhibitor
Name:
BDBM228133
Synonyms:
(2s)-2-ethoxy-n-hydroxy-3-{4-[(3-iodobenzyl)oxy]phenyl}propanamide (compound no. 7) | US9562012, 3
Type:
Small organic molecule
Emp. Form.:
C18H22N2O5
Mol. Mass.:
346.3777
SMILES:
CCO[C@@H](Cc1ccc(OCc2cc(CO)ccn2)cc1)C(=O)NO
: