Target
Nuclear receptor coactivator 2 [740-753]
Ligand
BDBM228136
Substrate
Meas. Tech.
Competitive Binding Assay
IC50
>195000±n/a nM
Citation
 Tanis, SPLarsen, SDArtman, III, GDParker, T PPAR-sparing compounds for the treatment of metabolic diseases US Patent  US9562012 Publication Date 2/7/2017 
Target
Name:
Nuclear receptor coactivator 2 [740-753]
Synonyms:
BHLHE75 NCOA2 Nuclear receptor coactivator 2 (aa 740-753) SRC2-3 peptide | TIF2
Type:
fluorescent labeled peptide
Mol. Mass.:
1704.90
Organism:
Description:
Q15596 aa 740-753
Residue:
14
KENALLRYLLDKDD
 
Inhibitor
Name:
BDBM228136
Synonyms:
US9562012, 6 | ethyl (2s)-2-ethoxy-3-{4-[(4-methoxypyridin-2-yl)methoxy]phenyl}propanoate
Type:
Small organic molecule
Emp. Form.:
C19H24N2O5
Mol. Mass.:
360.4043
SMILES:
CCO[C@@H](Cc1ccc(OCc2cc(CO)ccn2)cc1)C(=O)N(C)O
: