Target
Nuclear receptor coactivator 2 [740-753]
Ligand
BDBM228138
Substrate
Meas. Tech.
Competitive Binding Assay
IC50
98500±n/a nM
Citation
 Tanis, SPLarsen, SDArtman, III, GDParker, T PPAR-sparing compounds for the treatment of metabolic diseases US Patent  US9562012 Publication Date 2/7/2017 
Target
Name:
Nuclear receptor coactivator 2 [740-753]
Synonyms:
BHLHE75 NCOA2 Nuclear receptor coactivator 2 (aa 740-753) SRC2-3 peptide | TIF2
Type:
fluorescent labeled peptide
Mol. Mass.:
1704.90
Organism:
Description:
Q15596 aa 740-753
Residue:
14
KENALLRYLLDKDD
 
Inhibitor
Name:
BDBM228138
Synonyms:
(2s)-2-ethoxy-n-hydroxy-3-{4-[(4-methoxypyridin-2-yl)methoxy]phenyl}propanamide hydrochloride (compound no. 3) | US9562012, 8
Type:
Small organic molecule
Emp. Form.:
C21H25NO6
Mol. Mass.:
387.4263
SMILES:
CCO[C@H](Cc1ccc(OCC(=O)c2cccc(CO)c2)cc1)C(=O)NOC
: