Target
Nuclear receptor coactivator 2 [740-753]
Ligand
BDBM228149
Substrate
Meas. Tech.
Competitive Binding Assay
IC50
>250000±n/a nM
Citation
 Tanis, SPLarsen, SDArtman, III, GDParker, T PPAR-sparing compounds for the treatment of metabolic diseases US Patent  US9562012 Publication Date 2/7/2017 
Target
Name:
Nuclear receptor coactivator 2 [740-753]
Synonyms:
BHLHE75 NCOA2 Nuclear receptor coactivator 2 (aa 740-753) SRC2-3 peptide | TIF2
Type:
fluorescent labeled peptide
Mol. Mass.:
1704.90
Organism:
Description:
Q15596 aa 740-753
Residue:
14
KENALLRYLLDKDD
 
Inhibitor
Name:
BDBM228149
Synonyms:
(2r)-2-ethoxy-3-{4-[(2r)-2-hydroxy-2-(3-methoxyphenyl)ethoxy]phenyl}-n-methoxypropanamide (compound no. 19) | US9562012, 19
Type:
Small organic molecule
Emp. Form.:
C21H27NO6
Mol. Mass.:
389.4422
SMILES:
CCO[C@H](Cc1ccc(OC[C@H](O)c2cccc(CO)c2)cc1)C(=O)NOC
: