Target
3-phosphoinositide-dependent protein kinase 1
Ligand
BDBM16981
Substrate
Serine/threonine-protein kinase AKT2
Meas. Tech.
PDK1-mediated AKT2 Activation Assay (cAKT2 33P-SPA)
IC50
18±n/a nM
Citation
 Islam, IBryant, JChou, YLKochanny, MJLee, WPhillips, GBYu, HAdler, MWhitlow, MHo, ELentz, DPolokoff, MASubramanyam, BWu, JMZhu, DFeldman, RIArnaiz, DO Indolinone based phosphoinositide-dependent kinase-1 (PDK1) inhibitors. Part 1: design, synthesis and biological activity. Bioorg Med Chem Lett 17:3814-8 (2007)  
Target
Name:
3-phosphoinositide-dependent protein kinase 1
Synonyms:
3-Phosphoinositide-Dependent Protein Kinase 1 (PDK1) 3-phosphoinositide-dependent protein kinase 1 3-phosphoinositide-dependent protein kinase 1 (PDK-1) Isoform 2 of 3-phosphoinositide-dependent protein kinase 1 PDPK1 Phosphoinositide-dependent protein kinase 1 (PDK1) hPDK1
Type:
Enzyme
Mol. Mass.:
63157.65
Organism:
Homo sapiens (Human)
Description:
O15530
Residue:
556
  
Inhibitor
Name:
BDBM16981
Synonyms:
BX-201 indolinone based inhibitor, 3l
Type:
Small organic molecule
Emp. Form.:
C14H12N4O2
Mol. Mass.:
268.2707
SMILES:
NC(=O)Nc1ccc2NC(=O)\C(=C/c3ccc[nH]3)c2c1
:
Substrate
Name:
RAC-beta serine/threonine-protein kinase
Synonyms:
AKT2 PKB beta Protein kinase B (Akt 2) Protein kinase B, beta RAC-alpha serine/threonine-protein kinase (AKT2) RAC-beta serine/threonine-protein kinase (AKT2) Serine/threonine-protein kinase AKT2 | Serine/threonine-protein kinase Rac alpha/beta
Type:
Enzyme
Mol. Mass.:
55766.64
Organism:
Homo sapiens (Human)
Description:
Residue:
481