Target
Oxysterols receptor LXR-beta
Ligand
BDBM155259
Substrate
Meas. Tech.
Radioligand Binding Assay
Ki
27.0±n/a nM
Citation
 Dong, CFan, YLeftheris, KLotesta, SDSingh, SBTice, CMZhao, WZheng, YZhuang, L Liver X receptor modulators US Patent  US9814715 Publication Date 11/14/2017 
Target
Name:
Oxysterols receptor LXR-beta
Synonyms:
LXRB Liver X, LXR beta NR1H2 Nuclear receptor NER Ubiquitously-expressed nuclear receptor
Type:
Enzyme Catalytic Domain
Mol. Mass.:
50978.79
Organism:
Homo sapiens (Human)
Description:
P55055
Residue:
460
  
Inhibitor
Name:
BDBM155259
Synonyms:
US9006244, E3a | US9814715, Example 3, isomer 1
Type:
Small organic molecule
Emp. Form.:
C20H21F3N4O2S
Mol. Mass.:
438.467
SMILES:
CC(C)[C@H]1N(CCn2c1cc1ccc(cc21)S(C)(=O)=O)c1nccc(n1)C(F)(F)F
: