Target
Mucosa-associated lymphoid tissue lymphoma translocation protein 1
Ligand
BDBM355896
Substrate
Meas. Tech.
Biochemical Assay
IC50
0.003±n/a nM
Citation
 Soldermann, CPQuancard, JSchlapbach, ASimic, OTintelnot-Blomley, MZoller, T Pyrazolo pyrimidine derivatives and their use as MALT1 inhibitors US Patent  US9815842 Publication Date 11/14/2017 
Target
Name:
Mucosa-associated lymphoid tissue lymphoma translocation protein 1
Synonyms:
MALT lymphoma-associated translocation MALT1 MLT Paracaspase
Type:
Enzyme
Mol. Mass.:
92257.81
Organism:
Homo sapiens (Human)
Description:
Q9UDY8
Residue:
824
  
Inhibitor
Name:
BDBM355896
Synonyms:
1-(3-chloro-4-(2H- 1,2,3-triazol-2- yl)phenyl)-3-(2- chloro-7- isopropylpyrazolo[1, 5-a]pyrimidin-6- yl)urea US9815842, Example 20
Type:
Small organic molecule
Emp. Form.:
C18H16Cl2N8O
Mol. Mass.:
431.279
SMILES:
CC(C)c1c(NC(=O)Nc2ccc(c(Cl)c2)-n2nccn2)cnc2cc(Cl)nn12
: